Reaction Details
TargetAdenosine receptor A3
LigandBDBM50170816
Substrate/Competitorn/a
Meas. Tech.ChEMBL_874127 (CHEMBL2187068)
Ki 47±n/a nM
Citation Baraldi, PGPreti, DBorea, PAVarani, K Medicinal chemistry of A3 adenosine receptor modulators: pharmacological activities and therapeutic implications. J Med Chem55:5676-703 (2012) 
 
Adenosine receptor A3
Name:Adenosine receptor A3
Type:G Protein-Coupled Receptor (GPCR)
Mol. Mass.:36197.32
Organism:Homo sapiens (Human)
Description:P0DMS8
Residue:318
BDBM50170816
NameBDBM50170816
Synonyms:CHEMBL363419 | Cyclohexyl-(2-phenoxy-9H-purin-6-yl)-amine
TypeSmall organic molecule
Emp. Form.C17H19N5O
Mol. Mass.309.3657
SMILESC1CCC(CC1)Nc1nc(Oc2ccccc2)nc2nc[nH]c12