Reaction Details
TargetAdenosine receptor A3
LigandBDBM50163020
Substrate/Competitorn/a
Meas. Tech.ChEMBL_874128 (CHEMBL2187069)
Ki 1±n/a nM
Citation Baraldi, PGPreti, DBorea, PAVarani, K Medicinal chemistry of A3 adenosine receptor modulators: pharmacological activities and therapeutic implications. J Med Chem55:5676-703 (2012) 
 
Adenosine receptor A3
Name:Adenosine receptor A3
Type:PROTEIN
Mol. Mass.:36643.73
Organism:Rattus norvegicus
Description:ChEMBL_479910
Residue:320
BDBM50163020
NameBDBM50163020
Synonyms:(1S,2R,3S,4R,5S)-4-(6-(3-chlorobenzylamino)-2-chloro-9H-purin-9-yl)-2,3-dihydroxy-N-methylbicyclo[3.1.0]hexane-1-carboxamide 1N-methyl-4-[2-chloro-6-(3-chlorobenzylamino)-9H-9-purinyl]-2,3-dihydroxy-(1S,2R,3S,4R,5S)-bicyclo[3.1.0]hexane-1-carboxamide | CHEMBL175543
TypeSmall organic molecule
Emp. Form.C20H20Cl2N6O3
Mol. Mass.463.317
SMILESCNC(=O)[C@@]12C[C@@H]1[C@H]([C@H](O)[C@@H]2O)n1cnc2c(NCc3cccc(Cl)c3)nc(Cl)nc12