Reaction Details
TargetAdenosine receptor A3
LigandBDBM50117109
Substrate/Competitorn/a
Meas. Tech.ChEMBL_874120 (CHEMBL2187061)
IC50 0.7±n/a nM
Citation Baraldi, PGPreti, DBorea, PAVarani, K Medicinal chemistry of A3 adenosine receptor modulators: pharmacological activities and therapeutic implications. J Med Chem55:5676-703 (2012) 
 
Adenosine receptor A3
Name:Adenosine receptor A3
Type:G Protein-Coupled Receptor (GPCR)
Mol. Mass.:36197.32
Organism:Homo sapiens (Human)
Description:P0DMS8
Residue:318
BDBM50117109
NameBDBM50117109
Synonyms:1-(2-Furan-2-yl-8-methyl-8H-pyrazolo[4,3-e][1,2,4]triazolo[1,5-c]pyrimidin-5-yl)-3-pyridin-4-yl-urea CHEMBL332091
TypeSmall organic molecule
Emp. Form.C17H13N9O2
Mol. Mass.375.3442
SMILESCn1cc2c(n1)nc(NC(=O)Nc1ccncc1)n1nc(nc21)-c1ccco1