Reaction Details
TargetAdenosine receptor A3
LigandBDBM50117215
Substrate/Competitorn/a
Meas. Tech.ChEMBL_874120 (CHEMBL2187061)
IC50 0.61±n/a nM
Citation Baraldi, PGPreti, DBorea, PAVarani, K Medicinal chemistry of A3 adenosine receptor modulators: pharmacological activities and therapeutic implications. J Med Chem55:5676-703 (2012) 
 
Adenosine receptor A3
Name:Adenosine receptor A3
Type:G Protein-Coupled Receptor (GPCR)
Mol. Mass.:36197.32
Organism:Homo sapiens (Human)
Description:P0DMS8
Residue:318
BDBM50117215
NameBDBM50117215
Synonyms:5-Butyl-8-(4-trifluoromethyl-phenyl)-3H-[1,2,4]triazolo[5,1-i]purine | CHEMBL123705
TypeSmall organic molecule
Emp. Form.C17H15F3N6
Mol. Mass.360.3364
SMILESCCCCc1nc2nc[nH]c2c2nc(nn12)-c1ccc(cc1)C(F)(F)F