Reaction Details
TargetAdenosine receptor A3
LigandBDBM50397727
Substrate/Competitorn/a
Meas. Tech.ChEMBL_874120 (CHEMBL2187061)
IC50 0.16±n/a nM
Citation Baraldi, PGPreti, DBorea, PAVarani, K Medicinal chemistry of A3 adenosine receptor modulators: pharmacological activities and therapeutic implications. J Med Chem55:5676-703 (2012) 
 
Adenosine receptor A3
Name:Adenosine receptor A3
Type:G Protein-Coupled Receptor (GPCR)
Mol. Mass.:36197.32
Organism:Homo sapiens (Human)
Description:P0DMS8
Residue:318
BDBM50397727
NameBDBM50397727
Synonyms:CHEMBL2181968
TypeSmall organic molecule
Emp. Form.C19H20F3N5O4
Mol. Mass.439.3884
SMILESOC[C@H]1O[C@H]([C@H](O)[C@@H]1O)n1cnc2c(nc(NCCc3ccccc3)nc12)C(F)(F)F