Reaction Details
TargetGlycogen synthase kinase-3 beta
LigandBDBM50397764
Substrate/Competitorn/a
Meas. Tech.ChEMBL_874339 (CHEMBL2182637)
Ki 4.4±n/a nM
Citation Berg, SBergh, MHellberg, SHögdin, KLo-Alfredsson, YSöderman, Pvon Berg, SWeigelt, TOrmö, MXue, YTucker, JNeelissen, JJerning, ENilsson, YBhat, R Discovery of novel potent and highly selective glycogen synthase kinase-3ß (GSK3ß) inhibitors for Alzheimer's disease: design, synthesis, and characterization of pyrazines. J Med Chem55:9107-19 (2012) 
 
Glycogen synthase kinase-3 beta
Name:Glycogen synthase kinase-3 beta
Type:Enzyme
Mol. Mass.:46756.38
Organism:Homo sapiens (Human)
Description:P49841
Residue:420
BDBM50397764
NameBDBM50397764
Synonyms:CHEMBL2177162
TypeSmall organic molecule
Emp. Form.C20H20N6O3S
Mol. Mass.424.476
SMILESNc1ncc(nc1C(=O)Nc1cccnc1)-c1ccc(cc1)S(=O)(=O)N1CCCC1