Reaction Details
TargetNeuronal acetylcholine receptor subunit alpha-4/beta-2
LigandBDBM50397901
Substrate/Competitorn/a
Meas. Tech.ChEMBL_872704 (CHEMBL2184684)
EC50 1700±n/a nM
Citation Mazurov, AAMiao, LBhatti, BSStrachan, JPAkireddy, SMurthy, SKombo, DXiao, YDHammond, PZhang, JHauser, TAJordan, KGMiller, CHSpeake, JDGatto, GJYohannes, D Discovery of 3-(5-chloro-2-furoyl)-3,7-diazabicyclo[3.3.0]octane (TC-6683, AZD1446), a novel highly selectivea4ß2 nicotinic acetylcholine receptor agonist for the treatment of cognitive disorders. J Med Chem55:9181-94 (2012) 
 
Neuronal acetylcholine receptor subunit alpha-4/beta-2
Name:Neuronal acetylcholine receptor subunit alpha-4/beta-2
Type:Protein
Mol. Mass.:n/a
Description:n/a
Components:This complex has 2 components.
Component 1
Name:Neuronal acetylcholine receptor subunit alpha-4
Synonyms:ACHA4_HUMAN CHRNA4 protein Neuronal acetylcholine receptor protein alpha-4 subunit Nicotinic acetylcholine receptor alpha4/beta2/alpha5
Type:n/a
Mol. Mass.:69963.49
Organism:Homo sapiens (Human)
Description:NACHRA4
Residue:627
Component 2
Name:Neuronal acetylcholine receptor subunit beta-2
Synonyms:ACHB2_HUMAN Neuronal acetylcholine receptor protein beta-2 subunit | Nicotinic acetylcholine receptor alpha3/beta2/alpha5
Type:Protein
Mol. Mass.:57020.50
Organism:Homo sapiens (Human)
Description:P17787
Residue:502
BDBM50397901
NameBDBM50397901
Synonyms:CHEMBL2179965
TypeSmall organic molecule
Emp. Form.C10H16N2O
Mol. Mass.180.2468
SMILESO=C(C1CC1)N1C[C@@H]2CN[C@H](C2)C1