Reaction Details
TargetLeukotriene A-4 hydrolase
LigandBDBM50397950
Substrate/Competitorn/a
Meas. Tech.ChEMBL_872712 (CHEMBL2185125)
Ki>100000±n/a nM
Citation Albrecht, SSalomon, EDefoin, ATarnus, C Rapid and efficient synthesis of a novel series of substituted aminobenzosuberone derivatives as potent, selective, non-peptidic neutral aminopeptidase inhibitors. Bioorg Med Chem20:4942-53 (2012) 
 
Leukotriene A-4 hydrolase
Name:Leukotriene A-4 hydrolase
Type:Hydrolase; metalloprotease
Mol. Mass.:69280.41
Organism:Homo sapiens (Human)
Description:Human recombinant LTA4H.
Residue:611
BDBM50397950
NameBDBM50397950
Synonyms:CHEMBL2179972
TypeSmall organic molecule
Emp. Form.C18H19NO
Mol. Mass.265.3496
SMILESN[C@H]1CCc2ccccc2[C@@H](Cc2ccccc2)C1=O