Reaction Details
TargetSerine-protein kinase ATM
LigandBDBM50208517
Substrate/Competitorn/a
Meas. Tech.ChEMBL_873195 (CHEMBL2183783)
IC50 14±n/a nM
Citation Finlay, MRGriffin, RJ Modulation of DNA repair by pharmacological inhibitors of the PIKK protein kinase family. Bioorg Med Chem Lett22:5352-9 (2012) 
 
Serine-protein kinase ATM
Name:Serine-protein kinase ATM
Type:Protein
Mol. Mass.:350696.72
Organism:Homo sapiens (Human)
Description:Q13315
Residue:3056
BDBM50208517
NameBDBM50208517
Synonyms:2-morpholin-4-yl-6-thianthren-1-yl-pyran-4-one KU-55933
TypeSmall organic molecule
Emp. Form.C21H17NO3S2
Mol. Mass.395.495
SMILESO=c1cc(oc(c1)-c1cccc2Sc3ccccc3Sc12)N1CCOCC1