Reaction Details
TargetMicrotubule-associated protein tau
LigandBDBM50398208
Substrate/Competitorn/a
Meas. Tech.ChEMBL_874179 (CHEMBL2187911)
IC50 42±n/a nM
Citation Boländer, AKieser, DVoss, CBauer, SSchön, CBurgold, SBittner, THölzer, JHeyny-von Haußen, RMall, GGoetschy, VCzech, CKnust, HBerger, RHerms, JHilger, ISchmidt, B Bis(arylvinyl)pyrazines, -pyrimidines, and -pyridazines as imaging agents for tau fibrils andß-amyloid plaques in Alzheimer's disease models. J Med Chem55:9170-80 (2012) 
 
Microtubule-associated protein tau
Name:Microtubule-associated protein tau
Type:Protein
Mol. Mass.:78928.63
Organism:Homo sapiens (Human)
Description:P10636
Residue:758
BDBM50398208
NameBDBM50398208
Synonyms:CHEMBL2181042
TypeSmall organic molecule
Emp. Form.C30H36N6
Mol. Mass.480.647
SMILESCN1CCN(CC1)c1ccc(\C=C\c2cnc(\C=C\c3ccc(cc3)N3CCN(C)CC3)cn2)cc1