Reaction Details
TargetReceptor-type tyrosine-protein kinase FLT3
LigandBDBM50364776
Substrate/Competitorn/a
Meas. Tech.ChEMBL_874452 (CHEMBL2184775)
IC50 44±n/a nM
Citation Drygin, DHaddach, MPierre, FRyckman, DM Potential use of selective and nonselective Pim kinase inhibitors for cancer therapy. J Med Chem55:8199-208 (2012) 
 
Receptor-type tyrosine-protein kinase FLT3
Name:Receptor-type tyrosine-protein kinase FLT3
Type:Enzyme
Mol. Mass.:112888.62
Organism:Homo sapiens (Human)
Description:P36888
Residue:993
BDBM50364776
NameBDBM50364776
Synonyms:CHEMBL1952141 | CHEMBL1952329
TypeSmall organic molecule
Emp. Form.C20H22F3N5O
Mol. Mass.405.4168
SMILESCN1CCC(CNc2ccc3ncc(-c4cccc(OC(F)(F)F)c4)n3n2)CC1