Reaction Details
TargetEndothelial PAS domain-containing protein 1
LigandBDBM50240865
Substrate/Competitorn/a
Meas. Tech.ChEMBL_875592 (CHEMBL2184390)
EC50 3300±n/a nM
Citation McKee, TCRabe, DBokesch, HRGrkovic, TWhitson, ELDiyabalanage, TVan Wyk, AWMarcum, SRGardella, RSGustafson, KRLinehan, WMMcMahon, JBBottaro, DP Inhibition of hypoxia inducible factor-2 transcription: isolation of active modulators from marine sponges. J Nat Prod75:1632-6 (2012) 
 
Endothelial PAS domain-containing protein 1
Name:Endothelial PAS domain-containing protein 1
Type:PROTEIN
Mol. Mass.:96453.58
Organism:Homo sapiens (Human)
Description:ChEMBL_1506501
Residue:870
BDBM50240865
NameBDBM50240865
Synonyms:(4aS,6aS,12aR,12bS)-10-Hydroxy-4,4,6a,12b-tetramethyl-1,2,3,4,4a,5,6,6a,12a,12b-decahydro-benzo[a]xanthen-9-one PUUPEHENONE
TypeSmall organic molecule
Emp. Form.C21H28O3
Mol. Mass.328.4452
SMILESCC1(C)CCC[C@@]2(C)[C@H]1CC[C@]1(C)OC3=CC(=O)C(=O)CC3=C[C@H]21