Reaction Details
TargetC-X-C chemokine receptor type 2
LigandBDBM50169045
Substrate/Competitorn/a
Meas. Tech.ChEMBL_875622 (CHEMBL2184853)
IC50 100±n/a nM
Citation Pease, JHoruk, R Chemokine receptor antagonists. J Med Chem55:9363-92 (2012) 
 
C-X-C chemokine receptor type 2
Name:C-X-C chemokine receptor type 2
Type:Protein
Mol. Mass.:40767.88
Organism:Homo sapiens (Human)
Description:P25025
Residue:360
BDBM50169045
NameBDBM50169045
Synonyms:(R)-2-(4-isobutylphenyl)-N-(methylsulfonyl)propanamide N-[(R)-2-(4-Isobutyl-phenyl)-propionyl]-methanesulfonamide
TypeSmall organic molecule
Emp. Form.C14H21NO3S
Mol. Mass.283.386
SMILESCC(C)Cc1ccc(cc1)[C@@H](C)C(=O)NS(C)(=O)=O