Reaction Details
TargetC-X-C chemokine receptor type 1
LigandBDBM50169045
Substrate/Competitorn/a
Meas. Tech.ChEMBL_875623 (CHEMBL2184854)
IC50 1±n/a nM
Citation Pease, JHoruk, R Chemokine receptor antagonists. J Med Chem55:9363-92 (2012) 
 
C-X-C chemokine receptor type 1
Name:C-X-C chemokine receptor type 1
Type:Enzyme
Mol. Mass.:39803.83
Organism:Homo sapiens (Human)
Description:P25024
Residue:350
BDBM50169045
NameBDBM50169045
Synonyms:(R)-2-(4-isobutylphenyl)-N-(methylsulfonyl)propanamide N-[(R)-2-(4-Isobutyl-phenyl)-propionyl]-methanesulfonamide
TypeSmall organic molecule
Emp. Form.C14H21NO3S
Mol. Mass.283.386
SMILESCC(C)Cc1ccc(cc1)[C@@H](C)C(=O)NS(C)(=O)=O