Reaction Details
TargetC-C chemokine receptor type 4
LigandBDBM50398341
Substrate/Competitorn/a
Meas. Tech.ChEMBL_875649 (CHEMBL2184880)
Ki 10±n/a nM
Citation Pease, JHoruk, R Chemokine receptor antagonists. J Med Chem55:9363-92 (2012) 
 
C-C chemokine receptor type 4
Name:C-C chemokine receptor type 4
Type:Enzyme
Mol. Mass.:41406.41
Organism:Homo sapiens (Human)
Description:P51679
Residue:360
BDBM50398341
NameBDBM50398341
Synonyms:CHEMBL2178575
TypeSmall organic molecule
Emp. Form.C21H19ClN4O5S2
Mol. Mass.506.982
SMILESCOc1cccc2n(Cc3cccc(NC(=O)CO)c3)nc(NS(=O)(=O)c3ccc(Cl)s3)c12