Reaction Details
TargetC-C chemokine receptor type 3
LigandBDBM50394155
Substrate/Competitorn/a
Meas. Tech.ChEMBL_875631 (CHEMBL2184862)
IC50 8.1±n/a nM
Citation Pease, JHoruk, R Chemokine receptor antagonists. J Med Chem55:9363-92 (2012) 
 
C-C chemokine receptor type 3
Name:C-C chemokine receptor type 3
Type:Enzyme
Mol. Mass.:41053.88
Organism:Homo sapiens (Human)
Description:P51677
Residue:355
BDBM50394155
NameBDBM50394155
Synonyms:CHEMBL2158814
TypeSmall organic molecule
Emp. Form.C24H29Cl2N3O4S
Mol. Mass.526.476
SMILESCc1ccc(cc1)S(=O)(=O)NC(=O)N1CCC(CC1)N1CCC(CC1)Oc1ccc(Cl)c(Cl)c1