Reaction Details
TargetC-C chemokine receptor type 3
LigandBDBM50209971
Substrate/Competitorn/a
Meas. Tech.ChEMBL_875648 (CHEMBL2184879)
IC50 2±n/a nM
Citation Pease, JHoruk, R Chemokine receptor antagonists. J Med Chem55:9363-92 (2012) 
 
C-C chemokine receptor type 3
Name:C-C chemokine receptor type 3
Type:Enzyme
Mol. Mass.:41053.88
Organism:Homo sapiens (Human)
Description:P51677
Residue:355
BDBM50209971
NameBDBM50209971
Synonyms:1-((1R,2S)-2-(((S)-3-(4-fluorobenzyl)piperidin-1-yl)methyl)cyclohexyl)-3-(3-acetylphenyl)urea | CHEMBL250689
TypeSmall organic molecule
Emp. Form.C28H36FN3O2
Mol. Mass.465.6027
SMILESCC(=O)c1cccc(NC(=O)N[C@@H]2CCCC[C@H]2CN2CCC[C@@H](Cc3ccc(F)cc3)C2)c1