Reaction Details
TargetC-C chemokine receptor type 2
LigandBDBM50398343
Substrate/Competitorn/a
Meas. Tech.ChEMBL_875650 (CHEMBL2184881)
IC50 5±n/a nM
Citation Pease, JHoruk, R Chemokine receptor antagonists. J Med Chem55:9363-92 (2012) 
 
C-C chemokine receptor type 2
Name:C-C chemokine receptor type 2
Type:Enzyme
Mol. Mass.:41932.32
Organism:Homo sapiens (Human)
Description:P41597
Residue:374
BDBM50398343
NameBDBM50398343
Synonyms:CHEMBL2178573 | US9394307, 4-chloro-N-(5-methyl-2-{7H-pyrrolo[2,3-d]pyrimidine-4-carbonyl}pyridin-3-yl)-3-(trifluoromethyl)benzene-1-sulfonamide
TypeSmall organic molecule
Emp. Form.C20H13ClF3N5O3S
Mol. Mass.495.862
SMILESCc1cnc(C(=O)c2ncnc3[nH]ccc23)c(NS(=O)(=O)c2ccc(Cl)c(c2)C(F)(F)F)c1