Reaction Details
TargetC-C chemokine receptor type 1
LigandBDBM25351
Substrate/Competitorn/a
Meas. Tech.ChEMBL_875652 (CHEMBL2184883)
Ki 5±n/a nM
Citation Pease, JHoruk, R Chemokine receptor antagonists. J Med Chem55:9363-92 (2012) 
 
C-C chemokine receptor type 1
Name:C-C chemokine receptor type 1
Type:Enzyme
Mol. Mass.:41180.69
Organism:Homo sapiens (Human)
Description:P32246
Residue:355
BDBM25351
NameBDBM25351
Synonyms:N-[2-(4-{[(4-fluorophenyl)methyl]carbamoyl}-5-hydroxy-1-methyl-6-oxo-1,6-dihydropyrimidin-2-yl)propan-2-yl]-5-methyl-1,3,4-oxadiazole-2-carboxamide | Raltegravir
TypeSmall organic molecule
Emp. Form.C20H21FN6O5
Mol. Mass.444.4163
SMILESCc1nnc(o1)C(=O)NC(C)(C)c1nc(C(=O)NCc2ccc(F)cc2)c(O)c(=O)n1C