Reaction Details
TargetC-C chemokine receptor type 1
LigandBDBM50398345
Substrate/Competitorn/a
Meas. Tech.ChEMBL_875652 (CHEMBL2184883)
Ki 1.8±n/a nM
Citation Pease, JHoruk, R Chemokine receptor antagonists. J Med Chem55:9363-92 (2012) 
 
C-C chemokine receptor type 1
Name:C-C chemokine receptor type 1
Type:Enzyme
Mol. Mass.:41180.69
Organism:Homo sapiens (Human)
Description:P32246
Residue:355
BDBM50398345
NameBDBM50398345
Synonyms:CHEMBL2178571
TypeSmall organic molecule
Emp. Form.C36H48N4O3
Mol. Mass.584.7913
SMILESNCC1CCCN(C1)C(=O)c1ccc2Oc3ccccc3C(C(=O)NC3CCN(C\C4=C\CCCCCCC4)CC3)c2c1