Reaction Details
TargetHistamine H1 receptor
LigandBDBM50398349
Substrate/Competitorn/a
Meas. Tech.ChEMBL_875614 (CHEMBL2184845)
Ki 47±n/a nM
Citation Pease, JHoruk, R Chemokine receptor antagonists. J Med Chem55:9363-92 (2012) 
 
Histamine H1 receptor
Name:Histamine H1 receptor
Type:G Protein-Coupled Receptor (GPCR)
Mol. Mass.:55808.72
Organism:Homo sapiens (Human)
Description:Cell pellets from SK-N-MC cells transfected with human H1 receptor were used in binding assay.
Residue:487
BDBM50398349
NameBDBM50398349
Synonyms:CHEMBL2178580
TypeSmall organic molecule
Emp. Form.C28H30FN5O2
Mol. Mass.487.5685
SMILES[#6]-c1ccc(nn1)-[#6](=O)-[#7]-1-[#6]-[#6]\[#6](-[#6]-[#6]-1)=[#6]\[#6](=O)-[#7]-[#6@@H]-1-[#6]-[#6]-[#7](-[#6]-c2ccc3cc(F)ccc3c2)-[#6]-1