Reaction Details
TargetC-C chemokine receptor type 1
LigandBDBM50398350
Substrate/Competitorn/a
Meas. Tech.ChEMBL_875641 (CHEMBL2184872)
IC50 9.6±n/a nM
Citation Pease, JHoruk, R Chemokine receptor antagonists. J Med Chem55:9363-92 (2012) 
 
C-C chemokine receptor type 1
Name:C-C chemokine receptor type 1
Type:Enzyme
Mol. Mass.:41180.69
Organism:Homo sapiens (Human)
Description:P32246
Residue:355
BDBM50398350
NameBDBM50398350
Synonyms:CHEMBL486030 | UCB-35625
TypeSmall organic molecule
Emp. Form.C29H37Cl2N2O2
Mol. Mass.516.522
SMILESCC[N+]1(CC2CCCCCC2)CCC(CC1)NC(=O)C1c2cc(Cl)ccc2Oc2ccc(Cl)cc12