Reaction Details
Target5-hydroxytryptamine receptor 4
LigandBDBM50398594
Substrate/Competitorn/a
Meas. Tech.ChEMBL_873996 (CHEMBL2185685)
Ki 0.74±n/a nM
Citation Brodney, MAJohnson, DESawant-Basak, ACoffman, KJDrummond, EMHudson, ELFisher, KENoguchi, HWaizumi, NMcDowell, LLPapanikolaou, APettersen, BASchmidt, AWTseng, EStutzman-Engwall, KRubitski, DMVanase-Frawley, MAGrimwood, S Identification of multiple 5-HT4 partial agonist clinical candidates for the treatment of Alzheimer's disease. J Med Chem55:9240-54 (2012) 
 
5-hydroxytryptamine receptor 4
Name:5-hydroxytryptamine receptor 4
Type:Enzyme
Mol. Mass.:43767.54
Organism:Homo sapiens (Human)
Description:Q13639
Residue:388
BDBM50398594
NameBDBM50398594
Synonyms:CHEMBL2179585
TypeSmall organic molecule
Emp. Form.C22H32N2O3
Mol. Mass.372.5011
SMILESCCCCN1CCC(COc2noc3cccc(OC4CCCC4)c23)CC1