Reaction Details
TargetUridine 5'-monophosphate synthase
LigandBDBM50398698
Substrate/Competitorn/a
Meas. Tech.ChEMBL_874989 (CHEMBL2183865)
Ki 28300±n/a nM
Citation Purohit, MKPoduch, EWei, LWCrandall, IETo, TKain, KCPai, EFKotra, LP Novel cytidine-based orotidine-5'-monophosphate decarboxylase inhibitors with an unusual twist. J Med Chem55:9988-97 (2012) 
 
Uridine 5'-monophosphate synthase
Name:Uridine 5'-monophosphate synthase
Type:Enzyme
Mol. Mass.:52224.99
Organism:Homo sapiens (Human)
Description:P11172
Residue:480
BDBM50398698
NameBDBM50398698
Synonyms:CHEMBL2178721
TypeSmall organic molecule
Emp. Form.C9H12N3O9P
Mol. Mass.337.1811
SMILESNc1ccn([C@@H]2O[C@H](COP([O-])([O-])=O)[C@@H](O)[C@H]2O)c(=O)[n+]1[O-]