Reaction Details
TargetKappa-type opioid receptor
LigandBDBM50398707
Substrate/Competitorn/a
Meas. Tech.ChEMBL_874995 (CHEMBL2183871)
Ki>100000±n/a nM
Citation De Marco, RTolomelli, ASpampinato, SBedini, AGentilucci, L Opioid activity profiles of oversimplified peptides lacking in the protonable N-terminus. J Med Chem55:10292-6 (2012) 
 
Kappa-type opioid receptor
Name:Kappa-type opioid receptor
Type:G Protein-Coupled Receptor (GPCR)
Mol. Mass.:42648.76
Organism:Homo sapiens (Human)
Description:P41145
Residue:380
BDBM50398707
NameBDBM50398707
Synonyms:CHEMBL2178726
TypeSmall organic molecule
Emp. Form.C19H24N6O4
Mol. Mass.400.4317
SMILESCC(=O)N[C@H](Cc1cnc[nH]1)C(=O)N[C@@H](Cc1ccccc1)C(=O)NCC(N)=O