Reaction Details
TargetMu-type opioid receptor
LigandBDBM50398701
Substrate/Competitorn/a
Meas. Tech.ChEMBL_874997 (CHEMBL2183873)
Ki 16±n/a nM
Citation De Marco, RTolomelli, ASpampinato, SBedini, AGentilucci, L Opioid activity profiles of oversimplified peptides lacking in the protonable N-terminus. J Med Chem55:10292-6 (2012) 
 
Mu-type opioid receptor
Name:Mu-type opioid receptor
Type:G Protein-Coupled Receptor (GPCR)
Mol. Mass.:44789.51
Organism:Homo sapiens (Human)
Description:P35372
Residue:400
BDBM50398701
NameBDBM50398701
Synonyms:CHEMBL2178732
TypeSmall organic molecule
Emp. Form.C22H24N4O3
Mol. Mass.392.451
SMILESCC(=O)N[C@H](Cc1c[nH]c2ccccc12)C(=O)N[C@@H](Cc1ccccc1)C(N)=O