Reaction Details
TargetSerine/threonine-protein kinase TAO1
LigandBDBM50347750
Substrate/Competitorn/a
Meas. Tech.ChEMBL_875218 (CHEMBL2186701)
Kd 1700±n/a nM
Citation Tahtouh, TElkins, JMFilippakopoulos, PSoundararajan, MBurgy, GDurieu, ECochet, CSchmid, RSLo, DCDelhommel, FOberholzer, AEPearl, LHCarreaux, FBazureau, JPKnapp, SMeijer, L Selectivity, cocrystal structures, and neuroprotective properties of leucettines, a family of protein kinase inhibitors derived from the marine sponge alkaloid leucettamine B. J Med Chem55:9312-30 (2012) 
 
Serine/threonine-protein kinase TAO1
Name:Serine/threonine-protein kinase TAO1
Type:PROTEIN
Mol. Mass.:116088.10
Organism:Homo sapiens (Human)
Description:ChEMBL_774606
Residue:1001
BDBM50347750
NameBDBM50347750
Synonyms:CHEMBL1802358
TypeSmall organic molecule
Emp. Form.C17H13N3O3
Mol. Mass.307.3034
SMILESO=C1NC(Nc2ccccc2)=NC1=Cc1ccc2OCOc2c1