Reaction Details
TargetGlycogen synthase kinase-3 alpha
LigandBDBM50292406
Substrate/Competitorn/a
Meas. Tech.ChEMBL_875246 (CHEMBL2187128)
IC50 7700±n/a nM
Citation Tahtouh, TElkins, JMFilippakopoulos, PSoundararajan, MBurgy, GDurieu, ECochet, CSchmid, RSLo, DCDelhommel, FOberholzer, AEPearl, LHCarreaux, FBazureau, JPKnapp, SMeijer, L Selectivity, cocrystal structures, and neuroprotective properties of leucettines, a family of protein kinase inhibitors derived from the marine sponge alkaloid leucettamine B. J Med Chem55:9312-30 (2012) 
 
Glycogen synthase kinase-3 alpha
Name:Glycogen synthase kinase-3 alpha
Type:Enzyme
Mol. Mass.:50991.79
Organism:Homo sapiens (Human)
Description:P49840
Residue:483
BDBM50292406
NameBDBM50292406
Synonyms:CHEMBL485053 | leucettamine B
TypeSmall organic molecule
Emp. Form.C12H11N3O3
Mol. Mass.245.234
SMILESCN1C(N)=NC(=Cc2ccc3OCOc3c2)C1=O