Reaction Details
TargetDual specificity protein kinase CLK2
LigandBDBM50292406
Substrate/Competitorn/a
Meas. Tech.ChEMBL_875431 (CHEMBL2182298)
IC50 2100±n/a nM
Citation Tahtouh, TElkins, JMFilippakopoulos, PSoundararajan, MBurgy, GDurieu, ECochet, CSchmid, RSLo, DCDelhommel, FOberholzer, AEPearl, LHCarreaux, FBazureau, JPKnapp, SMeijer, L Selectivity, cocrystal structures, and neuroprotective properties of leucettines, a family of protein kinase inhibitors derived from the marine sponge alkaloid leucettamine B. J Med Chem55:9312-30 (2012) 
 
Dual specificity protein kinase CLK2
Name:Dual specificity protein kinase CLK2
Type:PROTEIN
Mol. Mass.:60021.57
Organism:Mus musculus
Description:ChEMBL_1502246
Residue:499
BDBM50292406
NameBDBM50292406
Synonyms:CHEMBL485053 | leucettamine B
TypeSmall organic molecule
Emp. Form.C12H11N3O3
Mol. Mass.245.234
SMILESCN1C(N)=NC(=Cc2ccc3OCOc3c2)C1=O