Reaction Details
TargetHistone deacetylase 1
LigandBDBM50398718
Substrate/Competitorn/a
Meas. Tech.ChEMBL_875959 (CHEMBL2188465)
IC50 1360±n/a nM
Citation Bergman, JAWoan, KPerez-Villarroel, PVillagra, ASotomayor, EMKozikowski, AP Selective histone deacetylase 6 inhibitors bearing substituted urea linkers inhibit melanoma cell growth. J Med Chem55:9891-9 (2012) 
 
Histone deacetylase 1
Name:Histone deacetylase 1
Type:Enzyme
Mol. Mass.:55090.27
Organism:Homo sapiens (Human)
Description:Q13547
Residue:482
BDBM50398718
NameBDBM50398718
Synonyms:CHEMBL2179245 US9409858, 8b US9956192, Compound 8b
TypeSmall organic molecule
Emp. Form.C19H23N3O4
Mol. Mass.357.4036
SMILESCOCCCN(C(=O)NCc1ccc(cc1)C(=O)NO)c1ccccc1