Reaction Details
TargetHistone deacetylase 1
LigandBDBM50398724
Substrate/Competitorn/a
Meas. Tech.ChEMBL_875959 (CHEMBL2188465)
IC50 8950±n/a nM
Citation Bergman, JAWoan, KPerez-Villarroel, PVillagra, ASotomayor, EMKozikowski, AP Selective histone deacetylase 6 inhibitors bearing substituted urea linkers inhibit melanoma cell growth. J Med Chem55:9891-9 (2012) 
 
Histone deacetylase 1
Name:Histone deacetylase 1
Type:Enzyme
Mol. Mass.:55090.27
Organism:Homo sapiens (Human)
Description:Q13547
Residue:482
BDBM50398724
NameBDBM50398724
Synonyms:CHEMBL2179250 US9409858, 5c US9956192, Compound 5c
TypeSmall organic molecule
Emp. Form.C26H26N4O4
Mol. Mass.458.509
SMILESCOc1ccccc1NC(=O)N(CCc1c[nH]c2ccccc12)Cc1ccc(cc1)C(=O)NO