Reaction Details
TargetNeuronal acetylcholine receptor subunit alpha-7
LigandBDBM50398817
Substrate/Competitorn/a
Meas. Tech.ChEMBL_873559 (CHEMBL2187476)
Ki 4.6±n/a nM
Citation Breining, SRMelvin, MBhatti, BSByrd, GDKiser, MNHepler, CDHooker, DNZhang, JReynolds, LABenson, LRFedorov, NBSidach, SSMitchener, JPLucero, LMLukas, RJWhiteaker, PYohannes, D Structure-activity studies of 7-heteroaryl-3-azabicyclo[3.3.1]non-6-enes: a novel class of highly potent nicotinic receptor ligands. J Med Chem55:9929-45 (2012) 
 
Neuronal acetylcholine receptor subunit alpha-7
Name:Neuronal acetylcholine receptor subunit alpha-7
Type:n/a
Mol. Mass.:56448.33
Organism:Homo sapiens (Human)
Description: CHRNA7 (NACHRA7)
Residue:502
BDBM50398817
NameBDBM50398817
Synonyms:CHEMBL2177541
TypeSmall organic molecule
Emp. Form.C14H18N2O
Mol. Mass.230.3055
SMILESCOc1cncc(c1)C1=CC2CNCC(C2)C1