Reaction Details
TargetNeuronal acetylcholine receptor subunit alpha-4/beta-2
LigandBDBM50398846
Substrate/Competitorn/a
Meas. Tech.ChEMBL_873553 (CHEMBL2187470)
EC50 85±n/a nM
Citation Breining, SRMelvin, MBhatti, BSByrd, GDKiser, MNHepler, CDHooker, DNZhang, JReynolds, LABenson, LRFedorov, NBSidach, SSMitchener, JPLucero, LMLukas, RJWhiteaker, PYohannes, D Structure-activity studies of 7-heteroaryl-3-azabicyclo[3.3.1]non-6-enes: a novel class of highly potent nicotinic receptor ligands. J Med Chem55:9929-45 (2012) 
 
Neuronal acetylcholine receptor subunit alpha-4/beta-2
Name:Neuronal acetylcholine receptor subunit alpha-4/beta-2
Type:Protein
Mol. Mass.:n/a
Description:n/a
Components:This complex has 2 components.
Component 1
Name:Neuronal acetylcholine receptor subunit alpha-4
Synonyms:ACHA4_HUMAN CHRNA4 protein Neuronal acetylcholine receptor protein alpha-4 subunit Nicotinic acetylcholine receptor alpha4/beta2/alpha5
Type:n/a
Mol. Mass.:69963.49
Organism:Homo sapiens (Human)
Description:NACHRA4
Residue:627
Component 2
Name:Neuronal acetylcholine receptor subunit beta-2
Synonyms:ACHB2_HUMAN Neuronal acetylcholine receptor protein beta-2 subunit | Nicotinic acetylcholine receptor alpha3/beta2/alpha5
Type:Protein
Mol. Mass.:57020.50
Organism:Homo sapiens (Human)
Description:P17787
Residue:502
BDBM50398846
NameBDBM50398846
Synonyms:CHEMBL2177532
TypeSmall organic molecule
Emp. Form.C19H20N2
Mol. Mass.276.3755
SMILESC1NCC2CC1CC(=C2)c1cncc(c1)-c1ccccc1