Reaction Details
TargetNeuronal acetylcholine receptor subunit alpha-7
LigandBDBM50398838
Substrate/Competitorn/a
Meas. Tech.ChEMBL_873559 (CHEMBL2187476)
Ki 22±n/a nM
Citation Breining, SRMelvin, MBhatti, BSByrd, GDKiser, MNHepler, CDHooker, DNZhang, JReynolds, LABenson, LRFedorov, NBSidach, SSMitchener, JPLucero, LMLukas, RJWhiteaker, PYohannes, D Structure-activity studies of 7-heteroaryl-3-azabicyclo[3.3.1]non-6-enes: a novel class of highly potent nicotinic receptor ligands. J Med Chem55:9929-45 (2012) 
 
Neuronal acetylcholine receptor subunit alpha-7
Name:Neuronal acetylcholine receptor subunit alpha-7
Type:n/a
Mol. Mass.:56448.33
Organism:Homo sapiens (Human)
Description: CHRNA7 (NACHRA7)
Residue:502
BDBM50398838
NameBDBM50398838
Synonyms:CHEMBL2177545
TypeSmall organic molecule
Emp. Form.C19H20N2O
Mol. Mass.292.3749
SMILESC1NCC2CC1CC(=C2)c1cncc(Oc2ccccc2)c1