Reaction Details
TargetEstrogen receptor
LigandBDBM50398941
Substrate/Competitorn/a
Meas. Tech.ChEMBL_874806 (CHEMBL2188850)
EC50 0.31±n/a nM
Citation Schäfer, AWellner, AStrauss, MSchäfer, AWolber, GGust, R Influence of chlorine or fluorine substitution on the estrogenic properties of 1-alkyl-2,3,5-tris(4-hydroxyphenyl)-1H-pyrroles. J Med Chem55:9607-18 (2012) 
 
Estrogen receptor
Name:Estrogen receptor
Type:Protein
Mol. Mass.:66230.44
Organism:Homo sapiens (Human)
Description:P03372
Residue:595
BDBM50398941
NameBDBM50398941
Synonyms:CHEMBL2179253
TypeSmall organic molecule
Emp. Form.C25H22ClNO3
Mol. Mass.419.9
SMILESCCCn1c(cc(c1-c1ccc(O)cc1Cl)-c1ccc(O)cc1)-c1ccc(O)cc1