Reaction Details
TargetC-X-C chemokine receptor type 4
LigandBDBM50399002
Substrate/Competitorn/a
Meas. Tech.ChEMBL_875045 (CHEMBL2184363)
EC50 467.74±n/a nM
Citation Mungalpara, JThiele, SEriksen, ØEksteen, JRosenkilde, MMVåbenø, J Rational design of conformationally constrained cyclopentapeptide antagonists for C-x-C chemokine receptor 4 (CXCR4). J Med Chem55:10287-91 (2012) 
 
C-X-C chemokine receptor type 4
Name:C-X-C chemokine receptor type 4
Type:Enzyme
Mol. Mass.:39754.61
Organism:Homo sapiens (Human)
Description:P61073
Residue:352
BDBM50399002
NameBDBM50399002
Synonyms:CHEMBL2180076
TypeSmall organic molecule
Emp. Form.C36H47N11O6
Mol. Mass.729.8285
SMILES[#7]\[#6](-[#7])=[#7]/[#6]-[#6]-[#6]-[#6@@H]-1-[#7]-[#6](=O)-[#6@H](-[#6]-[#6]-[#6]\[#7]=[#6](/[#7])-[#7])-[#7]-[#6](=O)-[#6@@H](-[#6]-c2ccc(-[#8])cc2)-[#7]-[#6](=O)-[#6]-[#7]-[#6](=O)-[#6@H](-[#6]-c2ccc3ccccc3c2)-[#7]-[#6]-1=O