Reaction Details
TargetCytochrome P450 2D6
LigandBDBM50399010
Substrate/Competitorn/a
Meas. Tech.ChEMBL_874075 (CHEMBL2186608)
IC50>10000±n/a nM
Citation Hanan, EJvan Abbema, ABarrett, KBlair, WSBlaney, JChang, CEigenbrot, CFlynn, SGibbons, PHurley, CAKenny, JRKulagowski, JLee, LMagnuson, SRMorris, CMurray, JPastor, RMRawson, TSiu, MUltsch, MZhou, ASampath, DLyssikatos, JP Discovery of potent and selective pyrazolopyrimidine janus kinase 2 inhibitors. J Med Chem55:10090-107 (2012) 
 
Cytochrome P450 2D6
Name:Cytochrome P450 2D6
Type:Protein
Mol. Mass.:55774.82
Organism:Homo sapiens (Human)
Description:P10635
Residue:497
BDBM50399010
NameBDBM50399010
Synonyms:CHEMBL2178252
TypeSmall organic molecule
Emp. Form.C17H13ClN6O
Mol. Mass.352.778
SMILESCn1cc(NC(=O)c2cnn3cccnc23)c(n1)-c1cccc(Cl)c1