Reaction Details
TargetCytochrome P450 2C19
LigandBDBM50399013
Substrate/Competitorn/a
Meas. Tech.ChEMBL_874040 (CHEMBL2186165)
IC50>10000±n/a nM
Citation Hanan, EJvan Abbema, ABarrett, KBlair, WSBlaney, JChang, CEigenbrot, CFlynn, SGibbons, PHurley, CAKenny, JRKulagowski, JLee, LMagnuson, SRMorris, CMurray, JPastor, RMRawson, TSiu, MUltsch, MZhou, ASampath, DLyssikatos, JP Discovery of potent and selective pyrazolopyrimidine janus kinase 2 inhibitors. J Med Chem55:10090-107 (2012) 
 
Cytochrome P450 2C19
Name:Cytochrome P450 2C19
Type:Enzyme
Mol. Mass.:55935.47
Organism:Homo sapiens (Human)
Description:P33261
Residue:490
BDBM50399013
NameBDBM50399013
Synonyms:CHEMBL2178248
TypeSmall organic molecule
Emp. Form.C18H12ClN5O
Mol. Mass.349.774
SMILESClc1cccc(c1)-c1ncccc1NC(=O)c1cnn2cccnc12