Reaction Details
TargetTyrosine-protein kinase JAK2
LigandBDBM50399021
Substrate/Competitorn/a
Meas. Tech.ChEMBL_874070 (CHEMBL2186603)
IC50 42.3±n/a nM
Citation Hanan, EJvan Abbema, ABarrett, KBlair, WSBlaney, JChang, CEigenbrot, CFlynn, SGibbons, PHurley, CAKenny, JRKulagowski, JLee, LMagnuson, SRMorris, CMurray, JPastor, RMRawson, TSiu, MUltsch, MZhou, ASampath, DLyssikatos, JP Discovery of potent and selective pyrazolopyrimidine janus kinase 2 inhibitors. J Med Chem55:10090-107 (2012) 
 
Tyrosine-protein kinase JAK2
Name:Tyrosine-protein kinase JAK2
Type:Protein
Mol. Mass.:130684.68
Organism:Homo sapiens (Human)
Description:O60674
Residue:1132
BDBM50399021
NameBDBM50399021
Synonyms:CHEMBL2178799 | US8999998, 28
TypeSmall organic molecule
Emp. Form.C17H12Cl2N6O
Mol. Mass.387.223
SMILESCn1cc(NC(=O)c2cnn3cccnc23)c(n1)-c1cc(Cl)ccc1Cl