Reaction Details
TargetTyrosine-protein kinase JAK2
LigandBDBM50399022
Substrate/Competitorn/a
Meas. Tech.ChEMBL_874063 (CHEMBL2186596)
Ki 2.1±n/a nM
Citation Hanan, EJvan Abbema, ABarrett, KBlair, WSBlaney, JChang, CEigenbrot, CFlynn, SGibbons, PHurley, CAKenny, JRKulagowski, JLee, LMagnuson, SRMorris, CMurray, JPastor, RMRawson, TSiu, MUltsch, MZhou, ASampath, DLyssikatos, JP Discovery of potent and selective pyrazolopyrimidine janus kinase 2 inhibitors. J Med Chem55:10090-107 (2012) 
 
Tyrosine-protein kinase JAK2
Name:Tyrosine-protein kinase JAK2
Type:Protein
Mol. Mass.:130684.68
Organism:Homo sapiens (Human)
Description:O60674
Residue:1132
BDBM50399022
NameBDBM50399022
Synonyms:CHEMBL2178266
TypeSmall organic molecule
Emp. Form.C19H18N6O
Mol. Mass.346.3858
SMILESCc1ccc(C)c(c1)-c1nn(C)cc1NC(=O)c1cnn2cccnc12