Reaction Details
TargetTyrosine-protein kinase JAK2
LigandBDBM50399028
Substrate/Competitorn/a
Meas. Tech.ChEMBL_874063 (CHEMBL2186596)
Ki 5.6±n/a nM
Citation Hanan, EJvan Abbema, ABarrett, KBlair, WSBlaney, JChang, CEigenbrot, CFlynn, SGibbons, PHurley, CAKenny, JRKulagowski, JLee, LMagnuson, SRMorris, CMurray, JPastor, RMRawson, TSiu, MUltsch, MZhou, ASampath, DLyssikatos, JP Discovery of potent and selective pyrazolopyrimidine janus kinase 2 inhibitors. J Med Chem55:10090-107 (2012) 
 
Tyrosine-protein kinase JAK2
Name:Tyrosine-protein kinase JAK2
Type:Protein
Mol. Mass.:130684.68
Organism:Homo sapiens (Human)
Description:O60674
Residue:1132
BDBM50399028
NameBDBM50399028
Synonyms:CHEMBL2178260
TypeSmall organic molecule
Emp. Form.C18H15ClN6O2
Mol. Mass.382.804
SMILESOCCn1cc(NC(=O)c2cnn3cccnc23)c(n1)-c1cccc(Cl)c1