Reaction Details
TargetTyrosine-protein kinase JAK2
LigandBDBM50399035
Substrate/Competitorn/a
Meas. Tech.ChEMBL_874063 (CHEMBL2186596)
Ki 7.1±n/a nM
Citation Hanan, EJvan Abbema, ABarrett, KBlair, WSBlaney, JChang, CEigenbrot, CFlynn, SGibbons, PHurley, CAKenny, JRKulagowski, JLee, LMagnuson, SRMorris, CMurray, JPastor, RMRawson, TSiu, MUltsch, MZhou, ASampath, DLyssikatos, JP Discovery of potent and selective pyrazolopyrimidine janus kinase 2 inhibitors. J Med Chem55:10090-107 (2012) 
 
Tyrosine-protein kinase JAK2
Name:Tyrosine-protein kinase JAK2
Type:Protein
Mol. Mass.:130684.68
Organism:Homo sapiens (Human)
Description:O60674
Residue:1132
BDBM50399035
NameBDBM50399035
Synonyms:CHEMBL2178249
TypeSmall organic molecule
Emp. Form.C18H12ClN5O
Mol. Mass.349.774
SMILESClc1cccc(c1)-c1cnccc1NC(=O)c1cnn2cccnc12