Reaction Details
TargetCytochrome P450 2C9
LigandBDBM50399037
Substrate/Competitorn/a
Meas. Tech.ChEMBL_874072 (CHEMBL2186605)
IC50>5000±n/a nM
Citation Hanan, EJvan Abbema, ABarrett, KBlair, WSBlaney, JChang, CEigenbrot, CFlynn, SGibbons, PHurley, CAKenny, JRKulagowski, JLee, LMagnuson, SRMorris, CMurray, JPastor, RMRawson, TSiu, MUltsch, MZhou, ASampath, DLyssikatos, JP Discovery of potent and selective pyrazolopyrimidine janus kinase 2 inhibitors. J Med Chem55:10090-107 (2012) 
 
Cytochrome P450 2C9
Name:Cytochrome P450 2C9
Type:Enzyme
Mol. Mass.:55636.33
Organism:Homo sapiens (Human)
Description:P11712
Residue:490
BDBM50399037
NameBDBM50399037
Synonyms:CHEMBL2178807
TypeSmall organic molecule
Emp. Form.C17H14ClN7O
Mol. Mass.367.792
SMILESCc1cc(NC(=O)c2cnn3ccc(N)nc23)n(n1)-c1cccc(Cl)c1