Reaction Details
TargetCytochrome P450 3A4
LigandBDBM50399035
Substrate/Competitorn/a
Meas. Tech.ChEMBL_874073 (CHEMBL2186606)
IC50 200±n/a nM
Citation Hanan, EJvan Abbema, ABarrett, KBlair, WSBlaney, JChang, CEigenbrot, CFlynn, SGibbons, PHurley, CAKenny, JRKulagowski, JLee, LMagnuson, SRMorris, CMurray, JPastor, RMRawson, TSiu, MUltsch, MZhou, ASampath, DLyssikatos, JP Discovery of potent and selective pyrazolopyrimidine janus kinase 2 inhibitors. J Med Chem55:10090-107 (2012) 
 
Cytochrome P450 3A4
Name:Cytochrome P450 3A4
Type:Enzyme
Mol. Mass.:57349.57
Organism:Homo sapiens (Human)
Description:n/a
Residue:503
BDBM50399035
NameBDBM50399035
Synonyms:CHEMBL2178249
TypeSmall organic molecule
Emp. Form.C18H12ClN5O
Mol. Mass.349.774
SMILESClc1cccc(c1)-c1cnccc1NC(=O)c1cnn2cccnc12