Reaction Details
TargetCytochrome P450 2C9
LigandBDBM50399012
Substrate/Competitorn/a
Meas. Tech.ChEMBL_874072 (CHEMBL2186605)
IC50>10000±n/a nM
Citation Hanan, EJvan Abbema, ABarrett, KBlair, WSBlaney, JChang, CEigenbrot, CFlynn, SGibbons, PHurley, CAKenny, JRKulagowski, JLee, LMagnuson, SRMorris, CMurray, JPastor, RMRawson, TSiu, MUltsch, MZhou, ASampath, DLyssikatos, JP Discovery of potent and selective pyrazolopyrimidine janus kinase 2 inhibitors. J Med Chem55:10090-107 (2012) 
 
Cytochrome P450 2C9
Name:Cytochrome P450 2C9
Type:Enzyme
Mol. Mass.:55636.33
Organism:Homo sapiens (Human)
Description:P11712
Residue:490
BDBM50399012
NameBDBM50399012
Synonyms:CHEMBL2178250
TypeSmall organic molecule
Emp. Form.C19H14ClN5O
Mol. Mass.363.8
SMILESCc1cc(NC(=O)c2cnn3cccnc23)c(cn1)-c1cccc(Cl)c1