Reaction Details
TargetCytochrome P450 1A2
LigandBDBM50399032
Substrate/Competitorn/a
Meas. Tech.ChEMBL_874066 (CHEMBL2186599)
IC50 500±n/a nM
Citation Hanan, EJvan Abbema, ABarrett, KBlair, WSBlaney, JChang, CEigenbrot, CFlynn, SGibbons, PHurley, CAKenny, JRKulagowski, JLee, LMagnuson, SRMorris, CMurray, JPastor, RMRawson, TSiu, MUltsch, MZhou, ASampath, DLyssikatos, JP Discovery of potent and selective pyrazolopyrimidine janus kinase 2 inhibitors. J Med Chem55:10090-107 (2012) 
 
Cytochrome P450 1A2
Name:Cytochrome P450 1A2
Type:Enzyme
Mol. Mass.:58423.38
Organism:Homo sapiens (Human)
Description:P05177
Residue:516
BDBM50399032
NameBDBM50399032
Synonyms:CHEMBL2178256
TypeSmall organic molecule
Emp. Form.C16H11ClN6O2
Mol. Mass.354.751
SMILESNc1ccn2ncc(C(=O)Nc3cnoc3-c3cccc(Cl)c3)c2n1