Reaction Details
TargetP2X purinoceptor 7
LigandBDBM50399183
Substrate/Competitorn/a
Meas. Tech.ChEMBL_876871 (CHEMBL2184465)
IC50>10000±n/a nM
Citation Hernandez-Olmos, VAbdelrahman, AEl-Tayeb, AFreudendahl, DWeinhausen, SMüller, CE N-substituted phenoxazine and acridone derivatives: structure-activity relationships of potent P2X4 receptor antagonists. J Med Chem55:9576-88 (2012) 
 
P2X purinoceptor 7
Name:P2X purinoceptor 7
Type:Protein
Mol. Mass.:68602.85
Organism:Homo sapiens (Human)
Description:Q99572
Residue:595
BDBM50399183
NameBDBM50399183
Synonyms:CHEMBL2180160
TypeSmall organic molecule
Emp. Form.C19H15NO3S
Mol. Mass.337.392
SMILESCc1ccc(cc1)S(=O)(=O)N1c2ccccc2Oc2ccccc12