Reaction Details
TargetP2X purinoceptor 2
LigandBDBM50399165
Substrate/Competitorn/a
Meas. Tech.ChEMBL_876873 (CHEMBL2184467)
IC50>10000±n/a nM
Citation Hernandez-Olmos, VAbdelrahman, AEl-Tayeb, AFreudendahl, DWeinhausen, SMüller, CE N-substituted phenoxazine and acridone derivatives: structure-activity relationships of potent P2X4 receptor antagonists. J Med Chem55:9576-88 (2012) 
 
P2X purinoceptor 2
Name:P2X purinoceptor 2
Type:Enzyme Catalytic Domain
Mol. Mass.:51765.18
Organism:Homo sapiens (Human)
Description:PurinergicP2X2/3 0 HUMAN::Q9UBL9
Residue:471
BDBM50399165
NameBDBM50399165
Synonyms:CHEMBL2180137
TypeSmall organic molecule
Emp. Form.C20H15NO3
Mol. Mass.317.338
SMILESO=C(OCc1ccccc1)N1c2ccccc2Oc2ccccc12