Reaction Details
TargetP2X purinoceptor 4
LigandBDBM50399190
Substrate/Competitorn/a
Meas. Tech.ChEMBL_876876 (CHEMBL2184470)
IC50 4040±n/a nM
Citation Hernandez-Olmos, VAbdelrahman, AEl-Tayeb, AFreudendahl, DWeinhausen, SMüller, CE N-substituted phenoxazine and acridone derivatives: structure-activity relationships of potent P2X4 receptor antagonists. J Med Chem55:9576-88 (2012) 
 
P2X purinoceptor 4
Name:P2X purinoceptor 4
Type:Enzyme Catalytic Domain
Mol. Mass.:43504.16
Organism:RAT
Description:Purinergic, P2X4 0 RAT::P51577
Residue:388
BDBM50399190
NameBDBM50399190
Synonyms:CHEMBL2180149
TypeSmall organic molecule
Emp. Form.C26H21NO
Mol. Mass.363.451
SMILESOC1(c2ccccc2)c2ccccc2N(Cc2ccccc2)c2ccccc12