Reaction Details
TargetP2X purinoceptor 4
LigandBDBM50399191
Substrate/Competitorn/a
Meas. Tech.ChEMBL_876885 (CHEMBL2184479)
IC50>10000±n/a nM
Citation Hernandez-Olmos, VAbdelrahman, AEl-Tayeb, AFreudendahl, DWeinhausen, SMüller, CE N-substituted phenoxazine and acridone derivatives: structure-activity relationships of potent P2X4 receptor antagonists. J Med Chem55:9576-88 (2012) 
 
P2X purinoceptor 4
Name:P2X purinoceptor 4
Type:Enzyme Catalytic Domain
Mol. Mass.:43374.70
Organism:Homo sapiens (Human)
Description:Purinergic, P2X4 0 HUMAN::Q99571
Residue:388
BDBM50399191
NameBDBM50399191
Synonyms:CHEMBL2180157
TypeSmall organic molecule
Emp. Form.C28H24N2O4
Mol. Mass.452.5012
SMILESO=C(Nc1ccccc1OCCOc1ccccc1NC(=O)c1ccccc1)c1ccccc1